Target
Testis-specific serine/threonine-protein kinase 1
Ligand
BDBM4552
Substrate
Meas. Tech.
ChEMBL_774622 (CHEMBL1908839)
Kd
4600±n/a nM
Citation
 Davis, MIHunt, JPHerrgard, SCiceri, PWodicka, LMPallares, GHocker, MTreiber, DKZarrinkar, PP Comprehensive analysis of kinase inhibitor selectivity. Nat Biotechnol 29:1046-51 (2011)  
Target
Name:
Testis-specific serine/threonine-protein kinase 1
Synonyms:
SPOGA1 STK22A TSSK1 TSSK1_HUMAN | Testis-specific serine/threonine-protein kinase 1
Type:
Enzyme Catalytic Domain
Mol. Mass.:
41624.03
Organism:
Homo sapiens (Human)
Description:
gi_14042947
Residue:
367
  
Inhibitor
Name:
BDBM4552
Synonyms:
4-[(2,4-Dichloro-5-methoxyphenyl)amino]-6-methoxy-7-[3-(4-methyl-1-piperazinyl)propoxy]-3-quinolinecarbonitrile BOSUTINIB SKI-606
Type:
Small organic molecule
Emp. Form.:
C26H29Cl2N5O3
Mol. Mass.:
530.446
SMILES:
COc1cc(Nc2c(cnc3cc(OCCCN4CCN(C)CC4)c(OC)cc23)C#N)c(Cl)cc1Cl
: