Target
Dual specificity mitogen-activated protein kinase kinase 7
Ligand
BDBM5445
Substrate
Meas. Tech.
ChEMBL_774202 (CHEMBL1908419)
Kd
4400±n/a nM
Citation
 Davis, MIHunt, JPHerrgard, SCiceri, PWodicka, LMPallares, GHocker, MTreiber, DKZarrinkar, PP Comprehensive analysis of kinase inhibitor selectivity. Nat Biotechnol 29:1046-51 (2011)  
Target
Name:
Dual specificity mitogen-activated protein kinase kinase 7
Synonyms:
Dual specificity mitogen-activated protein kinase kinase 7 JNKK2 MEK7 MP2K7_HUMAN SKK4
Type:
Protein
Mol. Mass.:
47502.52
Organism:
Homo sapiens (Human)
Description:
O14733
Residue:
419
  
Inhibitor
Name:
BDBM5445
Synonyms:
CHEMBL554 LAPATINIB DITOSYLATE N-{3-chloro-4-[(3-fluoro-benzyl)oxy]phenyl}-6-[5-({2-(methylsulfonyl)ethyl]amino}methyl)-2-furyl]-4-quinazolinamine Tykerb US10822334, Compound Lapatinib cid_208908
Type:
Small organic molecule
Emp. Form.:
C29H26ClFN4O4S
Mol. Mass.:
581.058
SMILES:
CS(=O)(=O)CCNCc1ccc(o1)-c1ccc2ncnc(Nc3ccc(OCc4cccc(F)c4)c(Cl)c3)c2c1
: