Target
Inhibitor of nuclear factor kappa-B kinase subunit epsilon
Ligand
BDBM50355499
Substrate
Meas. Tech.
ChEMBL_774554 (CHEMBL1908771)
Kd
1300±n/a nM
Citation
 Davis, MIHunt, JPHerrgard, SCiceri, PWodicka, LMPallares, GHocker, MTreiber, DKZarrinkar, PP Comprehensive analysis of kinase inhibitor selectivity. Nat Biotechnol 29:1046-51 (2011)  
Target
Name:
Inhibitor of nuclear factor kappa-B kinase subunit epsilon
Synonyms:
I kappa-B kinase epsilon I-kappa-B kinase epsilon (IKK-E) IKBKE IKK-epsilon IKKE IKKI KIAA0151 | von Hippel-Lindau disease tumor suppressor/Inhibitor of nuclear factor kappa-B kinase subunit epsilon
Type:
Serine/threonine-protein kinase
Mol. Mass.:
80475.98
Organism:
Homo sapiens (Human)
Description:
Kinase inhibitory activity was determined using recombinant human IKK-epsilon expressed in baculovirus as a FLAG-tagged fusion protein.
Residue:
716
  
Inhibitor
Name:
BDBM50355499
Synonyms:
CHEMBL1908395 | CHEMBL1908842
Type:
Small organic molecule
Emp. Form.:
C26H32N6O2
Mol. Mass.:
460.5713
SMILES:
CN(C)CC(=O)N1CCC(CC1)c1ccc(NC(=O)c2ncc([nH]2)C#N)c(c1)C1=CCCCC1
: