Target
Peripheral plasma membrane protein CASK
Ligand
BDBM50322823
Substrate
Meas. Tech.
ChEMBL_774229 (CHEMBL1908446)
Kd
>10000±n/a nM
Citation
 Davis, MIHunt, JPHerrgard, SCiceri, PWodicka, LMPallares, GHocker, MTreiber, DKZarrinkar, PP Comprehensive analysis of kinase inhibitor selectivity. Nat Biotechnol 29:1046-51 (2011)  
Target
Name:
Peripheral plasma membrane protein CASK
Synonyms:
CASK Calcium/calmodulin-dependent serine protein kinase Protein lin-2 homolog | hCASK
Type:
PROTEIN
Mol. Mass.:
105119.01
Organism:
Homo sapiens (Human)
Description:
ChEMBL_774229
Residue:
926
  
Inhibitor
Name:
BDBM50322823
Synonyms:
(S)-N-(4-(3-chloro-4-fluorophenylamino)-7-(tetrahydrofuran-3-yloxy)quinazolin-6-yl)-4-(dimethylamino)but-2-enamide CHEMBL1173655 US10196365, Afatinib US11896597, Compound Afatinib US9890168, Compound BIBW2992 | WO2022090481, Example afatinib
Type:
Small organic molecule
Emp. Form.:
C24H25ClFN5O3
Mol. Mass.:
485.938
SMILES:
CN(C)C\C=C\C(=O)Nc1cc2c(Nc3ccc(F)c(Cl)c3)ncnc2cc1O[C@H]1CCOC1
: