Target
Casein kinase I isoform alpha-like
Ligand
BDBM4851
Substrate
Meas. Tech.
ChEMBL_774203 (CHEMBL1908420)
Kd
>10000±n/a nM
Citation
 Davis, MIHunt, JPHerrgard, SCiceri, PWodicka, LMPallares, GHocker, MTreiber, DKZarrinkar, PP Comprehensive analysis of kinase inhibitor selectivity. Nat Biotechnol 29:1046-51 (2011)  
Target
Name:
Casein kinase I isoform alpha-like
Synonyms:
CSNK1A1L KC1AL_HUMAN
Type:
PROTEIN
Mol. Mass.:
39105.63
Organism:
Homo sapiens (Human)
Description:
ChEMBL_586447
Residue:
337
  
Inhibitor
Name:
BDBM4851
Synonyms:
(4-chlorophenyl)-[4-(4-pyridylmethyl)phthalazin-1-yl]amine CGP 79787 CHEMBL75232 N-(4-chlorophenyl)-4-(pyridin-4-ylmethyl)phthalazin-1-amine PTK787 cid_151194
Type:
Small organic molecule
Emp. Form.:
C20H15ClN4
Mol. Mass.:
346.813
SMILES:
Clc1ccc(Nc2nnc(Cc3ccncc3)c3ccccc23)cc1
: