Target
Mitogen-activated protein kinase kinase kinase 2
Ligand
BDBM50355504
Substrate
Meas. Tech.
ChEMBL_774542 (CHEMBL1908759)
Kd
1900±n/a nM
Citation
 Davis, MIHunt, JPHerrgard, SCiceri, PWodicka, LMPallares, GHocker, MTreiber, DKZarrinkar, PP Comprehensive analysis of kinase inhibitor selectivity. Nat Biotechnol 29:1046-51 (2011)  
Target
Name:
Mitogen-activated protein kinase kinase kinase 2
Synonyms:
M3K2_HUMAN MAPK/ERK kinase kinase 2 MEK kinase 2 MEKK2
Type:
PROTEIN
Mol. Mass.:
69751.14
Organism:
Homo sapiens (Human)
Description:
ChEMBL_1473904
Residue:
619
  
Inhibitor
Name:
BDBM50355504
Synonyms:
CHEMBL1908393
Type:
Small organic molecule
Emp. Form.:
C34H36F2N4O6
Mol. Mass.:
634.6696
SMILES:
COc1cc2c(Oc3ccc(NC(=O)C4(CC4)C(=O)NC4=CCC(F)C=C4)cc3F)ccnc2cc1OCCCN1CCOCC1
: