Target
Serine/threonine-protein kinase ULK1
Ligand
BDBM31093
Substrate
Meas. Tech.
ChEMBL_774396 (CHEMBL1908613)
Kd
>10000±n/a nM
Citation
 Davis, MIHunt, JPHerrgard, SCiceri, PWodicka, LMPallares, GHocker, MTreiber, DKZarrinkar, PP Comprehensive analysis of kinase inhibitor selectivity. Nat Biotechnol 29:1046-51 (2011)  
Target
Name:
Serine/threonine-protein kinase ULK1
Synonyms:
ATG1 KIAA0722 ULK1_HUMAN hATG1
Type:
PROTEIN
Mol. Mass.:
112661.80
Organism:
Homo sapiens (Human)
Description:
ChEMBL_1510275
Residue:
1050
  
Inhibitor
Name:
BDBM31093
Synonyms:
4-[[7-[2,6-bis(fluoranyl)phenyl]-9-chloranyl-5H-pyrimido[5,4-d][2]benzazepin-2-yl]amino]benzoic acid BDBM31832 MLN-8054 | cid_11712649
Type:
Small organic molecule
Emp. Form.:
C25H15ClF2N4O2
Mol. Mass.:
476.862
SMILES:
OC(=O)c1ccc(Nc2ncc3CN=C(c4cc(Cl)ccc4-c3n2)c2c(F)cccc2F)cc1
: