Target
Tyrosine-protein kinase ABL2
Ligand
BDBM13534
Substrate
Meas. Tech.
ChEMBL_774473 (CHEMBL1908690)
Kd
4±n/a nM
Citation
 Davis, MIHunt, JPHerrgard, SCiceri, PWodicka, LMPallares, GHocker, MTreiber, DKZarrinkar, PP Comprehensive analysis of kinase inhibitor selectivity. Nat Biotechnol 29:1046-51 (2011)  
Target
Name:
Tyrosine-protein kinase ABL2
Synonyms:
ABL2 ABLL Abelson murine leukemia viral oncogene homolog 2 Tyrosine kinase ARG | VHL/Tyrosine-protein kinase ABL2
Type:
PROTEIN
Mol. Mass.:
128360.63
Organism:
Homo sapiens (Human)
Description:
ChEMBL_325082
Residue:
1182
  
Inhibitor
Name:
BDBM13534
Synonyms:
CHEMBL572878 N-[4-[[4-(4-methylpiperazino)-6-[(5-methyl-1H-pyrazol-3-yl)amino]pyrimidin-2-yl]thio]phenyl]cyclopropanecarboxamide VX680 | cyclopropane carboxylic acid {4-[4-(4-methyl-piperazin-1-yl)-6-(5-methyl-2H-pyrazol-3-ylamino)-pyrimidin-2ylsulphanyl]-phenyl}-amide
Type:
Small organic molecule
Emp. Form.:
C23H28N8OS
Mol. Mass.:
464.586
SMILES:
CN1CCN(CC1)c1cc(Nc2cc(C)n[nH]2)nc(Sc2ccc(NC(=O)C3CC3)cc2)n1
: