Target
Collagenase 3
Ligand
BDBM50356219
Substrate
Meas. Tech.
ChEMBL_774908 (CHEMBL1913353)
IC50
2.6±n/a nM
Citation
 Hu, YXing, LThomason, JRXiang, JIpek, MGuler, SLi, HSabatini, JChockalingam, PReifenberg, ESheldon, RMorris, EAGeorgiadis, KETam, S Continued exploration of biphenylsulfonamide scaffold as a platform for aggrecanase-1 inhibition. Bioorg Med Chem Lett 21:6800-3 (2011)  
Target
Name:
Collagenase 3
Synonyms:
MMP-13 MMP13_HUMAN Matrix metalloproteinase-13 (MMP-13) | Matrix metalloproteinase-13 (MMP13)
Type:
Enzyme
Mol. Mass.:
53808.06
Organism:
Homo sapiens (Human)
Description:
P45452
Residue:
471
  
Inhibitor
Name:
BDBM50356219
Synonyms:
CHEMBL1910649
Type:
Small organic molecule
Emp. Form.:
C26H27NO7S
Mol. Mass.:
497.56
SMILES:
COC(=O)c1cccc(COc2ccc(cc2)-c2ccc(cc2)S(=O)(=O)N[C@H](C(C)C)C(O)=O)c1
: