Target
Histamine H4 receptor
Ligand
BDBM50356818
Substrate
Meas. Tech.
ChEMBL_786095 (CHEMBL1919838)
Ki
11±n/a nM
Citation
 Savall, BMGomez, LChavez, FCurtis, MMeduna, SPKearney, ADunford, PCowden, JThurmond, RLGrice, CEdwards, JP Tricyclic aminopyrimidine histamine H4 receptor antagonists. Bioorg Med Chem Lett 21:6577-81 (2011)  
Target
Name:
Histamine H4 receptor
Synonyms:
AXOR35 GPCR105 HH4R HRH4 Histamine H4 receptor Histamine receptor (H3 and H4) SP9144
Type:
G Protein-Coupled Receptor (GPCR)
Mol. Mass.:
44517.02
Organism:
Homo sapiens (Human)
Description:
Binding assays were using CHO cells stably expressing hH4R receptors.
Residue:
390
  
Inhibitor
Name:
BDBM50356818
Synonyms:
CHEMBL1914784
Type:
Small organic molecule
Emp. Form.:
C16H19N5O2
Mol. Mass.:
313.3544
SMILES:
CN[C@@H]1CCN(C1)c1nc(N)nc2c3cc(OC)ccc3oc12
: