Target
Acyl-CoA desaturase 1
Ligand
BDBM50301057
Substrate
Meas. Tech.
ChEMBL_785447 (CHEMBL1919826)
IC50
100±n/a nM
Citation
 Leclerc, JPFalgueyret, JPGirardin, MGuay, JGuiral, SHuang, ZLi, CSOballa, RRamtohul, YKSkorey, KTawa, PWang, HZhang, L Conversion of systemically-distributed triazole-based stearoyl-CoA desaturase (SCD) uHTS hits into liver-targeted SCD inhibitors. Bioorg Med Chem Lett 21:6505-9 (2011)  
Target
Name:
Acyl-CoA desaturase 1
Synonyms:
ACOD1_RAT Scd Stearoyl-CoA desaturase 1 (SCD1)
Type:
Enzyme
Mol. Mass.:
41485.97
Organism:
Rattus norvegicus (Rat)
Description:
P07308
Residue:
358
  
Inhibitor
Name:
BDBM50301057
Synonyms:
2-(4-(2-(trifluoromethyl)benzoyl)piperazin-1-yl)thiazole-5-carboxamide MF-152
Type:
Small organic molecule
Emp. Form.:
C16H15F3N4O2S
Mol. Mass.:
384.376
SMILES:
NC(=O)c1cnc(s1)N1CCN(CC1)C(=O)c1ccccc1C(F)(F)F
: