Target
Acyl-CoA desaturase 1
Ligand
BDBM50356895
Substrate
Meas. Tech.
ChEMBL_785447 (CHEMBL1919826)
IC50
19900±n/a nM
Citation
 Leclerc, JPFalgueyret, JPGirardin, MGuay, JGuiral, SHuang, ZLi, CSOballa, RRamtohul, YKSkorey, KTawa, PWang, HZhang, L Conversion of systemically-distributed triazole-based stearoyl-CoA desaturase (SCD) uHTS hits into liver-targeted SCD inhibitors. Bioorg Med Chem Lett 21:6505-9 (2011)  
Target
Name:
Acyl-CoA desaturase 1
Synonyms:
ACOD1_RAT Scd Stearoyl-CoA desaturase 1 (SCD1)
Type:
Enzyme
Mol. Mass.:
41485.97
Organism:
Rattus norvegicus (Rat)
Description:
P07308
Residue:
358
  
Inhibitor
Name:
BDBM50356895
Synonyms:
CHEMBL1915545
Type:
Small organic molecule
Emp. Form.:
C13H10Br3N7O2
Mol. Mass.:
535.976
SMILES:
OC(=O)Cn1nnc(n1)-c1cn(CCc2cc(Br)c(Br)c(Br)c2)nn1
: