Target
Laccase
Ligand
BDBM26985
Substrate
Meas. Tech.
ChEMBL_786156 (CHEMBL1919990)
IC50
257000±n/a nM
Citation
 Dalisay, DSSaludes, JPMolinski, TF Ptilomycalin A inhibits laccase and melanization in Cryptococcus neoformans. Bioorg Med Chem 19:6654-7 (2011)  
Target
Name:
Laccase
Synonyms:
Type:
PROTEIN
Mol. Mass.:
55472.53
Organism:
Trametes versicolor
Description:
ChEMBL_786157
Residue:
520
  
Inhibitor
Name:
BDBM26985
Synonyms:
2-triaza-1,2-diyne CHEMBL89295 azide
Type:
Ion
Emp. Form.:
N3
Mol. Mass.:
42.0206
SMILES:
[N-]=[N+]=[N-]
: