Target
Mitogen-activated protein kinase 14
Ligand
BDBM31619
Substrate
Meas. Tech.
ChEMBL_787635 (CHEMBL1918088)
IC50
21±n/a nM
Citation
 Lumeras, WVidal, LVidal, BBalagué, COrellana, AMaldonado, MDomínguez, MSegarra, VCaturla, F 1,7-Naphthyridine 1-oxides as novel potent and selective inhibitors of p38 mitogen activated protein kinase. J Med Chem 54:7899-910 (2011)  
Target
Name:
Mitogen-activated protein kinase 14
Synonyms:
CSAID-binding protein CSBP1 CSPB1 MAP kinase 14 MAP kinase p38 alpha MAPK14 MK14_HUMAN Mitogen-activated protein kinase p38 alpha Stress-activated protein kinase 2a | p38 MAP kinase alpha/beta
Type:
Serine/threonine-protein kinase
Mol. Mass.:
41286.76
Organism:
Homo sapiens (Human)
Description:
Q16539
Residue:
360
  
Inhibitor
Name:
BDBM31619
Synonyms:
Aminopyridine N-oxide, 45
Type:
Small organic molecule
Emp. Form.:
C19H14F2N2O2
Mol. Mass.:
340.3235
SMILES:
Cc1ccccc1-c1c(N)c(cc[n+]1[O-])C(=O)c1ccc(F)cc1F
: