Target
Insulin-like growth factor 1 receptor
Ligand
BDBM50358249
Substrate
Meas. Tech.
ChEMBL_790772 (CHEMBL1926225)
IC50
>100000±n/a nM
Citation
 Lai, DYu, Svan Ofwegen, LTotzke, FProksch, PLin, W 9,10-secosteroids, protein kinase inhibitors from the Chinese gorgonian Astrogorgia sp. Bioorg Med Chem 19:6873-80 (2011)  
Target
Name:
Insulin-like growth factor 1 receptor
Synonyms:
CD_antigen=CD221 IGF1R Insulin-like growth factor 1 receptor (IGF1R) Insulin-like growth factor 1 receptor alpha chain Insulin-like growth factor I receptor | Insulin-like growth factor receptor (IGFR)
Type:
Protein
Mol. Mass.:
154776.79
Organism:
Homo sapiens (Human)
Description:
P08069
Residue:
1367
  
Inhibitor
Name:
BDBM50358249
Synonyms:
CHEMBL515982
Type:
Small organic molecule
Emp. Form.:
C28H44O2
Mol. Mass.:
412.6478
SMILES:
CC(C)C(=C)CC[C@@H](C)[C@H]1CC[C@H]2[C@H](CCc3cc(O)ccc3C)[C@H](O)CC[C@]12C
: