Target
Serine/threonine-protein kinase Nek2
Ligand
BDBM50358249
Substrate
Meas. Tech.
ChEMBL_790775 (CHEMBL1926228)
IC50
>100000±n/a nM
Citation
 Lai, DYu, Svan Ofwegen, LTotzke, FProksch, PLin, W 9,10-secosteroids, protein kinase inhibitors from the Chinese gorgonian Astrogorgia sp. Bioorg Med Chem 19:6873-80 (2011)  
Target
Name:
Serine/threonine-protein kinase Nek2
Synonyms:
NEK kinase NEK2A NLK1
Type:
Enzyme
Mol. Mass.:
51776.96
Organism:
Homo sapiens (Human)
Description:
P51955
Residue:
445
  
Inhibitor
Name:
BDBM50358249
Synonyms:
CHEMBL515982
Type:
Small organic molecule
Emp. Form.:
C28H44O2
Mol. Mass.:
412.6478
SMILES:
CC(C)C(=C)CC[C@@H](C)[C@H]1CC[C@H]2[C@H](CCc3cc(O)ccc3C)[C@H](O)CC[C@]12C
: