Target
Galanin receptor type 2
Ligand
BDBM50358663
Substrate
Meas. Tech.
ChEMBL_789439 (CHEMBL1924415)
IC50
4570±n/a nM
Citation
 Sagi, VNLiu, TLu, XBartfai, TRoberts, E Synthesis and biological evaluation of novel pyrimidine derivatives as sub-micromolar affinity ligands of GalR2. Bioorg Med Chem Lett 21:7210-5 (2011)  
Target
Name:
Galanin receptor type 2
Synonyms:
GALNR2 GALR2_HUMAN Galanin receptor 2 Galanin receptor type 2 (GAL2-R) (GALR2).
Type:
Enzyme Catalytic Domain
Mol. Mass.:
41724.40
Organism:
Homo sapiens (Human)
Description:
Galanin R2 GALR2 HUMAN::O43603
Residue:
387
  
Inhibitor
Name:
BDBM50358663
Synonyms:
CHEMBL1921901
Type:
Small organic molecule
Emp. Form.:
C23H27N5
Mol. Mass.:
373.494
SMILES:
Cc1ccc(C)c(Nc2cc(Nc3ccccc3)nc(n2)N2CCCCC2)c1
: