Target
Galanin receptor type 2
Ligand
BDBM50358685
Substrate
Meas. Tech.
ChEMBL_789439 (CHEMBL1924415)
IC50
2850±n/a nM
Citation
 Sagi, VNLiu, TLu, XBartfai, TRoberts, E Synthesis and biological evaluation of novel pyrimidine derivatives as sub-micromolar affinity ligands of GalR2. Bioorg Med Chem Lett 21:7210-5 (2011)  
Target
Name:
Galanin receptor type 2
Synonyms:
GALNR2 GALR2_HUMAN Galanin receptor 2 Galanin receptor type 2 (GAL2-R) (GALR2).
Type:
Enzyme Catalytic Domain
Mol. Mass.:
41724.40
Organism:
Homo sapiens (Human)
Description:
Galanin R2 GALR2 HUMAN::O43603
Residue:
387
  
Inhibitor
Name:
BDBM50358685
Synonyms:
CHEMBL1922017
Type:
Small organic molecule
Emp. Form.:
C22H26FN5O2
Mol. Mass.:
411.4725
SMILES:
CCN(CC)c1cc(Nc2ccc(OC)c(F)c2)nc(Nc2ccc(OC)cc2)n1
: