Target
Rho-associated protein kinase 1
Ligand
BDBM50358690
Substrate
Meas. Tech.
ChEMBL_789446 (CHEMBL1924422)
IC50
39±n/a nM
Citation
 Sessions, EHChowdhury, SYin, YPocas, JRGrant, WSchröter, TLin, LRuiz, CCameron, MDLoGrasso, PBannister, TDFeng, Y Discovery and optimization of indole and 7-azaindoles as Rho kinase (ROCK) inhibitors (part-II). Bioorg Med Chem Lett 21:7113-8 (2011)  
Target
Name:
Rho-associated protein kinase 1
Synonyms:
ROCK-I ROCK1_HUMAN Rho-associated protein kinase Rho-associated, coiled-coil-containing protein kinase 1 Rho-kinase (ROCK I) p160 ROCK-1 | p160ROCK
Type:
Serine/threonine-protein kinase
Mol. Mass.:
158156.77
Organism:
Homo sapiens (Human)
Description:
Q13464
Residue:
1354
  
Inhibitor
Name:
BDBM50358690
Synonyms:
CHEMBL1922142
Type:
Small organic molecule
Emp. Form.:
C25H29N7O2
Mol. Mass.:
459.5435
SMILES:
COc1cccc(CNC(=O)c2[nH]c3nc(ccc3c2CN2CCN(C)CC2)-c2cn[nH]c2)c1
: