Target
Tyrosine-protein kinase JAK2
Ligand
BDBM50358893
Substrate
Meas. Tech.
ChEMBL_790799 (CHEMBL1926252)
IC50
0.5±n/a nM
Citation
 Weinberg, LRAlbom, MSAngeles, TSBreslin, HJGingrich, DEHuang, ZLisko, JGMason, JLMilkiewicz, KLThieu, TVUnderiner, TLWells, GJWells-Knecht, KJDorsey, BD 2,7-Pyrrolo[2,1-f][1,2,4]triazines as JAK2 inhibitors: modification of target structure to minimize reactive metabolite formation. Bioorg Med Chem Lett 21:7325-30 (2011)  
Target
Name:
Tyrosine-protein kinase JAK2
Synonyms:
JAK-2 JAK2_HUMAN Janus kinase 2 (JAK2) | Janus kinase 2 (a protein tyrosine kinase)
Type:
Protein
Mol. Mass.:
130684.68
Organism:
Homo sapiens (Human)
Description:
O60674
Residue:
1132
  
Inhibitor
Name:
BDBM50358893
Synonyms:
CHEMBL1923594
Type:
Small organic molecule
Emp. Form.:
C26H30N6O2
Mol. Mass.:
458.5554
SMILES:
COc1ccc(cn1)-c1ccc2cnc(Nc3ccc(cc3)C3CCN(C[C@H](C)O)CC3)nn12
: