Target
Androgen receptor
Ligand
BDBM22372
Substrate
Meas. Tech.
ChEMBL_791031 (CHEMBL1925692)
IC50
>50000±n/a nM
Citation
 Lack, NAAxerio-Cilies, PTavassoli, PHan, FQChan, KHFeau, CLeBlanc, EGuns, ETGuy, RKRennie, PSCherkasov, A Targeting the binding function 3 (BF3) site of the human androgen receptor through virtual screening. J Med Chem 54:8563-73 (2011)  
Target
Name:
Androgen receptor
Synonyms:
ANDR_HUMAN Androgen Receptor Androgen receptor/Baculoviral IAP repeat-containing protein 2 Dihydrotestosterone receptor Nuclear receptor subfamily 3 group C member 4
Type:
Receptor
Mol. Mass.:
99185.27
Organism:
Homo sapiens (Human)
Description:
CHO cells were stably transfected with human AR gene.
Residue:
920
  
Inhibitor
Name:
BDBM22372
Synonyms:
4-[(2R,3S)-4-(3,4-dihydroxyphenyl)-2,3-dimethylbutyl]benzene-1,2-diol CHEMBL313972 NDGA | Nordihydroguaiaretic Acid
Type:
Antioxidant
Emp. Form.:
C18H22O4
Mol. Mass.:
302.3649
SMILES:
C[C@@H](Cc1ccc(O)c(O)c1)[C@H](C)Cc1ccc(O)c(O)c1
: