Target
P2X purinoceptor 7
Ligand
BDBM50359221
Substrate
Meas. Tech.
ChEMBL_790225 (CHEMBL1925618)
IC50
25±n/a nM
Citation
 Brumfield, SMatasi, JJTulshian, DCzarniecki, MGreenlee, WGarlisi, CQiu, HDevito, KChen, SCSun, YBertorelli, RAnsell, JGeiss, WLe, VDMartin, GSVellekoop, SAHaber, JAllard, ML Synthesis and SAR development of novel P2X7 receptor antagonists for the treatment of pain: part 2. Bioorg Med Chem Lett 21:7287-90 (2011)  
Target
Name:
P2X purinoceptor 7
Synonyms:
ATP receptor P2RX7_HUMAN P2X purinoceptor 7 (P2X7) P2Z receptor | Purinergic receptor
Type:
Protein
Mol. Mass.:
68602.85
Organism:
Homo sapiens (Human)
Description:
Q99572
Residue:
595
  
Inhibitor
Name:
BDBM50359221
Synonyms:
CHEMBL1923316
Type:
Small organic molecule
Emp. Form.:
C30H28F2N6O
Mol. Mass.:
526.5797
SMILES:
CCN1C2=NC(C)(C)CN2c2c(nc(-c3ccc(nc3)-c3cccc(C)c3)n2Cc2ccc(F)c(F)c2)C1=O
: