Target
P2X purinoceptor 7
Ligand
BDBM50359212
Substrate
Meas. Tech.
ChEMBL_790225 (CHEMBL1925618)
IC50
85±n/a nM
Citation
 Brumfield, SMatasi, JJTulshian, DCzarniecki, MGreenlee, WGarlisi, CQiu, HDevito, KChen, SCSun, YBertorelli, RAnsell, JGeiss, WLe, VDMartin, GSVellekoop, SAHaber, JAllard, ML Synthesis and SAR development of novel P2X7 receptor antagonists for the treatment of pain: part 2. Bioorg Med Chem Lett 21:7287-90 (2011)  
Target
Name:
P2X purinoceptor 7
Synonyms:
ATP receptor P2RX7_HUMAN P2X purinoceptor 7 (P2X7) P2Z receptor | Purinergic receptor
Type:
Protein
Mol. Mass.:
68602.85
Organism:
Homo sapiens (Human)
Description:
Q99572
Residue:
595
  
Inhibitor
Name:
BDBM50359212
Synonyms:
CHEMBL1923307
Type:
Small organic molecule
Emp. Form.:
C30H27F2N5O
Mol. Mass.:
511.5651
SMILES:
CCN1C2=NC(C)(C)CN2c2c(nc(-c3ccc(cc3)-c3ccccc3)n2Cc2ccc(F)c(F)c2)C1=O
: