Target
Ephrin type-A receptor 1
Ligand
BDBM50359359
Substrate
Meas. Tech.
ChEMBL_793869 (CHEMBL1932842)
IC50
>30000±n/a nM
Citation
 Moffett, KKonteatis, ZNguyen, DShetty, RLudington, JFujimoto, TLee, KJChai, XNamboodiri, HKarpusas, MDorsey, BGuarnieri, FBukhtiyarova, MSpringman, EMichelotti, E Discovery of a novel class of non-ATP site DFG-out state p38 inhibitors utilizing computationally assisted virtual fragment-based drug design (vFBDD). Bioorg Med Chem Lett 21:7155-65 (2011)  
Target
Name:
Ephrin type-A receptor 1
Synonyms:
EPH EPH tyrosine kinase 1 EPHA1_HUMAN EPHT1 Ephrin type-A receptor 1 Erythropoietin-producing hepatoma receptor hEpha1
Type:
Enzyme
Mol. Mass.:
108128.04
Organism:
Homo sapiens (Human)
Description:
P21709
Residue:
976
  
Inhibitor
Name:
BDBM50359359
Synonyms:
CHEMBL1929238
Type:
Small organic molecule
Emp. Form.:
C25H33Cl2N5O3S
Mol. Mass.:
554.532
SMILES:
CN(C)CCN1CCN(CCC1=O)C(=O)c1cc(sc1NC(=O)Nc1cccc(Cl)c1Cl)C(C)(C)C
: