Target
Trace amine-associated receptor 1
Ligand
BDBM50022723
Substrate
Meas. Tech.
ChEMBL_792735 (CHEMBL1930650)
EC50
1010±n/a nM
Citation
 Lewin, AHMiller, GMGilmour, B Trace amine-associated receptor 1 is a stereoselective binding site for compounds in the amphetamine class. Bioorg Med Chem 19:7044-8 (2011)  
Target
Name:
Trace amine-associated receptor 1
Synonyms:
TA1 TAAR1_MACMU TRAR1 Trace amine receptor 1
Type:
PROTEIN
Mol. Mass.:
38812.87
Organism:
Macaca mulatta
Description:
ChEMBL_792735
Residue:
338
  
Inhibitor
Name:
BDBM50022723
Synonyms:
(+)-(S)-amphetamine (+)-alpha-methylphenylethylamine (S)-(+)-amphetamine (S)-1-phenyl-2-aminopropane (S)-alpha-methylbenzeneethanamine (alphaS)-alpha-methylbenzeneethanamine Dextroamphetamine dexamphetamine
Type:
Small organic molecule
Emp. Form.:
C9H13N
Mol. Mass.:
135.2062
SMILES:
C[C@H](N)Cc1ccccc1
: