Target
Trace amine-associated receptor 1
Ligand
BDBM50010588
Substrate
Meas. Tech.
ChEMBL_792738 (CHEMBL1930653)
EC50
1700±n/a nM
Citation
 Lewin, AHMiller, GMGilmour, B Trace amine-associated receptor 1 is a stereoselective binding site for compounds in the amphetamine class. Bioorg Med Chem 19:7044-8 (2011)  
Target
Name:
Trace amine-associated receptor 1
Synonyms:
TAAR1_RAT Taar1 Trace amine receptor 1 (TARR1) Trace amine-associated receptor 1 (TAAR1) Trar1
Type:
Enzyme
Mol. Mass.:
38034.73
Organism:
Rattus norvegicus (Rat)
Description:
Q923Y9
Residue:
332
  
Inhibitor
Name:
BDBM50010588
Synonyms:
(RS)-3,4-(methylenedioxy)methamphetamine 1-(1,3-benzodioxol-5-yl)-N-methylpropan-2-amine CHEMBL43048 MDMA N-Methyl-3,4-methylenedioxyamphetamine | US11767305, Compound MDMA
Type:
Small organic molecule
Emp. Form.:
C11H15NO2
Mol. Mass.:
193.2423
SMILES:
CNC(C)Cc1ccc2OCOc2c1
: