Target
Trace amine-associated receptor 1
Ligand
BDBM50022721
Substrate
Meas. Tech.
ChEMBL_792741 (CHEMBL1930656)
EC50
65±n/a nM
Citation
 Lewin, AHMiller, GMGilmour, B Trace amine-associated receptor 1 is a stereoselective binding site for compounds in the amphetamine class. Bioorg Med Chem 19:7044-8 (2011)  
Target
Name:
Trace amine-associated receptor 1
Synonyms:
TAAR1_MOUSE Taar1 Trace amine receptor 1 (TARR1) Trace amine-associated receptor1 | Trar1
Type:
Protein
Mol. Mass.:
37635.41
Organism:
Mus musculus (Mouse)
Description:
Q923Y8
Residue:
332
  
Inhibitor
Name:
BDBM50022721
Synonyms:
(R)-amphetamine CHEMBL19393
Type:
Small organic molecule
Emp. Form.:
C9H13N
Mol. Mass.:
135.2062
SMILES:
C[C@@H](N)Cc1ccccc1
: