Target
Trace amine-associated receptor 1
Ligand
BDBM50359505
Substrate
Meas. Tech.
ChEMBL_792743 (CHEMBL1930658)
EC50
1510±n/a nM
Citation
 Lewin, AHMiller, GMGilmour, B Trace amine-associated receptor 1 is a stereoselective binding site for compounds in the amphetamine class. Bioorg Med Chem 19:7044-8 (2011)  
Target
Name:
Trace amine-associated receptor 1
Synonyms:
TA1 TAAR1_HUMAN TRAR1 | trace amine-associated receptor 1
Type:
PROTEIN
Mol. Mass.:
39107.47
Organism:
Homo sapiens (Human)
Description:
ChEMBL_792734
Residue:
339
  
Inhibitor
Name:
BDBM50359505
Synonyms:
CHEMBL1182312
Type:
Small organic molecule
Emp. Form.:
C14H14INO2
Mol. Mass.:
355.1709
SMILES:
NCCc1ccc(Oc2ccc(O)cc2)c(I)c1
: