Target
Sodium-dependent dopamine transporter
Ligand
BDBM50022723
Substrate
Meas. Tech.
ChEMBL_792746 (CHEMBL1930661)
EC50
24.8±n/a nM
Citation
 Lewin, AHMiller, GMGilmour, B Trace amine-associated receptor 1 is a stereoselective binding site for compounds in the amphetamine class. Bioorg Med Chem 19:7044-8 (2011)  
Target
Name:
Sodium-dependent dopamine transporter
Synonyms:
DA transporter DAT1 Dopamine transporter protein (DAT) SC6A3_HUMAN Sodium-dependent dopamine transporter Solute carrier family 6 member 3
Type:
Multi-pass membrane protein
Mol. Mass.:
68497.11
Organism:
Homo sapiens (Human)
Description:
Q01959
Residue:
620
  
Inhibitor
Name:
BDBM50022723
Synonyms:
(+)-(S)-amphetamine (+)-alpha-methylphenylethylamine (S)-(+)-amphetamine (S)-1-phenyl-2-aminopropane (S)-alpha-methylbenzeneethanamine (alphaS)-alpha-methylbenzeneethanamine Dextroamphetamine dexamphetamine
Type:
Small organic molecule
Emp. Form.:
C9H13N
Mol. Mass.:
135.2062
SMILES:
C[C@H](N)Cc1ccccc1
: