Target
Sodium-dependent serotonin transporter
Ligand
BDBM50022723
Substrate
Meas. Tech.
ChEMBL_792747 (CHEMBL1930662)
EC50
1770±n/a nM
Citation
 Lewin, AHMiller, GMGilmour, B Trace amine-associated receptor 1 is a stereoselective binding site for compounds in the amphetamine class. Bioorg Med Chem 19:7044-8 (2011)  
Target
Name:
Sodium-dependent serotonin transporter
Synonyms:
5-HT Transporter 5HTT SC6A4_HUMAN SLC6A4 Serotonin transporter (5HTT) Sodium-dependent serotonin transporter (SERT) | Solute carrier family 6 member 4
Type:
Multi-pass membrane protein
Mol. Mass.:
70322.51
Organism:
Homo sapiens (Human)
Description:
P31645
Residue:
630
  
Inhibitor
Name:
BDBM50022723
Synonyms:
(+)-(S)-amphetamine (+)-alpha-methylphenylethylamine (S)-(+)-amphetamine (S)-1-phenyl-2-aminopropane (S)-alpha-methylbenzeneethanamine (alphaS)-alpha-methylbenzeneethanamine Dextroamphetamine dexamphetamine
Type:
Small organic molecule
Emp. Form.:
C9H13N
Mol. Mass.:
135.2062
SMILES:
C[C@H](N)Cc1ccccc1
: