Target
Prostaglandin E2 receptor EP4 subtype
Ligand
BDBM50360165
Substrate
Meas. Tech.
ChEMBL_793560 (CHEMBL1932311)
Ki
2.4±n/a nM
Citation
 Kambe, TMaruyama, TNagase, TOgawa, SMinamoto, CSakata, KMaruyama, TNakai, HToda, M Synthesis and evaluation of novel modified¿-lactam prostanoids as EP4 subtype-selective agonists. Bioorg Med Chem 20:702-13 (2012)  
Target
Name:
Prostaglandin E2 receptor EP4 subtype
Synonyms:
PE2R4_MOUSE Prostanoid EP4 receptor Ptgerep4
Type:
G-protein coupled receptor
Mol. Mass.:
56175.66
Organism:
Mus musculus (Mouse)
Description:
Residue:
513
  
Inhibitor
Name:
BDBM50360165
Synonyms:
CHEMBL1929532
Type:
Small organic molecule
Emp. Form.:
C22H31NO5S
Mol. Mass.:
421.55
SMILES:
CCCc1cccc(C[C@H](O)\C=C\[C@H]2COC(=O)N2CCSCCCC(O)=O)c1
: