Target
Prostaglandin E2 receptor EP1 subtype
Ligand
BDBM50360151
Substrate
Meas. Tech.
ChEMBL_793557 (CHEMBL1932308)
Ki
>10000±n/a nM
Citation
 Kambe, TMaruyama, TNagase, TOgawa, SMinamoto, CSakata, KMaruyama, TNakai, HToda, M Synthesis and evaluation of novel modified¿-lactam prostanoids as EP4 subtype-selective agonists. Bioorg Med Chem 20:702-13 (2012)  
Target
Name:
Prostaglandin E2 receptor EP1 subtype
Synonyms:
PE2R1_MOUSE Prostaglandin E1 Prostanoid EP1 receptor Ptgerep1
Type:
G-protein coupled receptor
Mol. Mass.:
43000.62
Organism:
Mus musculus (Mouse)
Description:
Residue:
405
  
Inhibitor
Name:
BDBM50360151
Synonyms:
CHEMBL1929543
Type:
Small organic molecule
Emp. Form.:
C19H24FNO4S2
Mol. Mass.:
413.527
SMILES:
O[C@@H](Cc1cccc(F)c1)\C=C\[C@H]1CSC(=O)N1CCSCCCC(O)=O
: