Target
Prostaglandin E2 receptor EP2 subtype
Ligand
BDBM50360165
Substrate
Meas. Tech.
ChEMBL_793558 (CHEMBL1932309)
Ki
>10000±n/a nM
Citation
 Kambe, TMaruyama, TNagase, TOgawa, SMinamoto, CSakata, KMaruyama, TNakai, HToda, M Synthesis and evaluation of novel modified¿-lactam prostanoids as EP4 subtype-selective agonists. Bioorg Med Chem 20:702-13 (2012)  
Target
Name:
Prostaglandin E2 receptor EP2 subtype
Synonyms:
PE2R2_MOUSE Prostaglandin E2 Prostanoid EP2 receptor Ptgerep2
Type:
G-protein coupled receptor
Mol. Mass.:
40495.26
Organism:
Mus musculus (Mouse)
Description:
Residue:
362
  
Inhibitor
Name:
BDBM50360165
Synonyms:
CHEMBL1929532
Type:
Small organic molecule
Emp. Form.:
C22H31NO5S
Mol. Mass.:
421.55
SMILES:
CCCc1cccc(C[C@H](O)\C=C\[C@H]2COC(=O)N2CCSCCCC(O)=O)c1
: