Target
Hemagglutinin
Ligand
BDBM50360451
Substrate
Meas. Tech.
ChEMBL_795513 (CHEMBL1935836)
IC50
>250000±n/a nM
Citation
 Suzuki, KKoyama, TYingsakmongkon, SSuzuki, YHatano, KMatsuoka, K Synthesis and biological evaluation of sialic acid derivatives containing a long hydrophobic chain at the anomeric position and their C-5 linked polymers as potent influenza virus inhibitors. Bioorg Med Chem 20:446-54 (2011)  
Target
Name:
Hemagglutinin
Synonyms:
HA Hemagglutinin HA1 chain | Hemagglutinin HA2 chain
Type:
PROTEIN
Mol. Mass.:
63416.64
Organism:
Influenza A virus (strain A/Aichi/2/1968 H3N2)
Description:
ChEMBL_795513
Residue:
566
  
Inhibitor
Name:
BDBM50360451
Synonyms:
CHEMBL1934619
Type:
Small organic molecule
Emp. Form.:
C12H19NO9
Mol. Mass.:
321.2806
SMILES:
OC[C@@H](O)[C@@H](O)[C@@H]1OC(O)(C[C@H](O)[C@H]1NC(=O)C=C)C(O)=O
: