Target
Hemagglutinin
Ligand
BDBM50360452
Substrate
Meas. Tech.
ChEMBL_795513 (CHEMBL1935836)
IC50
7810±n/a nM
Citation
 Suzuki, KKoyama, TYingsakmongkon, SSuzuki, YHatano, KMatsuoka, K Synthesis and biological evaluation of sialic acid derivatives containing a long hydrophobic chain at the anomeric position and their C-5 linked polymers as potent influenza virus inhibitors. Bioorg Med Chem 20:446-54 (2011)  
Target
Name:
Hemagglutinin
Synonyms:
HA Hemagglutinin HA1 chain | Hemagglutinin HA2 chain
Type:
PROTEIN
Mol. Mass.:
63416.64
Organism:
Influenza A virus (strain A/Aichi/2/1968 H3N2)
Description:
ChEMBL_795513
Residue:
566
  
Inhibitor
Name:
BDBM50360452
Synonyms:
CHEMBL1934620
Type:
Small organic molecule
Emp. Form.:
C30H54N2O9S
Mol. Mass.:
618.823
SMILES:
CCCCCCCCCCCCS[C@@]1(C[C@H](O)[C@@H](NC(=O)CCCCCNC(=O)C=C)[C@@H](O1)[C@H](O)[C@H](O)CO)C(O)=O
: