Target
Amine oxidase [flavin-containing] B
Ligand
BDBM50361478
Substrate
Meas. Tech.
ChEMBL_797216 (CHEMBL1942531)
Ki
7400±n/a nM
Citation
 Suzuki, TMiyata, N Lysine demethylases inhibitors. J Med Chem 54:8236-50 (2011)  
Target
Name:
Amine oxidase [flavin-containing] B
Synonyms:
AOFB_HUMAN MAOB Monoamine oxidase type B (MAO B) Monoamine oxidase type B (MAOB)
Type:
Protein
Mol. Mass.:
58768.76
Organism:
Homo sapiens (Human)
Description:
P27338
Residue:
520
  
Inhibitor
Name:
BDBM50361478
Synonyms:
CHEMBL1938897
Type:
Small organic molecule
Emp. Form.:
C19H21NO2
Mol. Mass.:
295.3755
SMILES:
CC(NC1CC1c1ccccc1)c1ccc2OCCOc2c1
: