Target
Met repressor
Ligand
BDBM50362006
Substrate
Meas. Tech.
ChEMBL_799628 (CHEMBL1941334)
EC50
36±n/a nM
Citation
 Joce, CWhite, RStockley, PGWarriner, STurnbull, WBNelson, A Design, synthesis and in vitro evaluation of novel bivalent S-adenosylmethionine analogues. Bioorg Med Chem Lett 22:278-84 (2011)  
Target
Name:
Met repressor
Synonyms:
Met regulon regulatory protein MetJ
Type:
PROTEIN
Mol. Mass.:
12138.09
Organism:
Escherichia coli
Description:
ChEMBL_799627
Residue:
105
  
Inhibitor
Name:
BDBM50362006
Synonyms:
CHEMBL1939714
Type:
Small organic molecule
Emp. Form.:
C23H33N8O4
Mol. Mass.:
485.5588
SMILES:
C[N+](C)(CC[C@H](N)C(=O)NCc1ccccc1)C[C@H]1O[C@H]([C@H](O)[C@@H]1O)n1cnc2c(N)ncnc12
: