Target
Corticotropin-releasing factor receptor 1
Ligand
BDBM50362265
Substrate
Meas. Tech.
ChEMBL_798649 (CHEMBL1942638)
EC50
1.9±n/a nM
Citation
 Saito, TObitsu, TKohno, HSugimoto, IMatsushita, TNishiyama, THirota, TTakeda, HMatsumura, NUeno, SKishi, AKagamiishi, YNakai, HTakaoka, Y Pyrrolo[1,2-b]pyridazines, pyrrolo[2,1-f]triazin-4(3H)-ones, and related compounds as novel corticotropin-releasing factor 1 (CRF¿?) receptor antagonists. Bioorg Med Chem 20:1122-38 (2012)  
Target
Name:
Corticotropin-releasing factor receptor 1
Synonyms:
CRF-R CRF1 CRFR1 CRH-R 1 CRHR1 Corticotropin-releasing factor receptor 1 (CRF-1) Corticotropin-releasing hormone receptor 1
Type:
Enzyme
Mol. Mass.:
50744.31
Organism:
Homo sapiens (Human)
Description:
P34998
Residue:
444
  
Inhibitor
Name:
BDBM50362265
Synonyms:
CHEMBL1939576
Type:
Small organic molecule
Emp. Form.:
C24H32N2O2
Mol. Mass.:
380.5231
SMILES:
CCC(CC)c1cc(C)n2nc(c(C)cc12)-c1cc(OC)c(OC)cc1CC
: