Target
Neuropeptides B/W receptor type 1
Ligand
BDBM50362436
Substrate
Meas. Tech.
ChEMBL_797951 (CHEMBL1942828)
IC50
18±n/a nM
Citation
 Anthony Romero, FHastings, NBMoningka, RGuo, ZWang, MDi Salvo, JLei, YTrusca, DDeng, QTong, VTerebetski, JLBall, RGUjjainwalla, F The discovery of potent antagonists of NPBWR1 (GPR7). Bioorg Med Chem Lett 22:1014-8 (2012)  
Target
Name:
Neuropeptides B/W receptor type 1
Synonyms:
G-protein coupled receptor 7 NPBW1_MOUSE | Npbwr1
Type:
PROTEIN
Mol. Mass.:
36085.77
Organism:
Mus musculus
Description:
ChEMBL_797950
Residue:
329
  
Inhibitor
Name:
BDBM50362436
Synonyms:
CHEMBL1940368
Type:
Small organic molecule
Emp. Form.:
C31H36N4O3S
Mol. Mass.:
544.708
SMILES:
COc1ccc(cc1)[C@@H](C)N[C@@H]1CC[C@@H]([C@H](C1)c1ccsc1)C(=O)N1CCN(CC1)c1nc2ccccc2o1
: