Target
Cholinesterase
Ligand
BDBM10949
Substrate
Meas. Tech.
ChEMBL_798012 (CHEMBL1942988)
IC50
48900±n/a nM
Citation
 Anand, PSingh, BSingh, N A review on coumarins as acetylcholinesterase inhibitors for Alzheimer's disease. Bioorg Med Chem 20:1175-80 (2012)  
Target
Name:
Cholinesterase
Synonyms:
Acylcholine acylhydrolase Butyrylcholine esterase (BChE) Butyrylcholinesterase (BuChE) CHLE_HUMAN Cholinesterases Pseudocholinesterase
Type:
Homotetramer
Mol. Mass.:
68422.27
Organism:
Homo sapiens (Human)
Description:
P06276
Residue:
602
  
Inhibitor
Name:
BDBM10949
Synonyms:
3-(4-{[Benzyl(methyl)amino]methyl}-phenyl)-6,7-dimethoxy-2H-2-chromenone AP2238 | CHEMBL75121
Type:
Small organic molecule
Emp. Form.:
C26H25NO4
Mol. Mass.:
415.481
SMILES:
COc1cc2cc(-c3ccc(CN(C)Cc4ccccc4)cc3)c(=O)oc2cc1OC
: