Target
Acetylcholinesterase
Ligand
BDBM50362874
Substrate
Meas. Tech.
ChEMBL_798010 (CHEMBL1942986)
IC50
360±n/a nM
Citation
 Anand, PSingh, BSingh, N A review on coumarins as acetylcholinesterase inhibitors for Alzheimer's disease. Bioorg Med Chem 20:1175-80 (2012)  
Target
Name:
Acetylcholinesterase
Synonyms:
ACES_RAT Acetylcholinesterase and butyrylcholinesterase (AChE and BChE) Acetylcholinesterase, AChE | Ache
Type:
Enzyme
Mol. Mass.:
68193.62
Organism:
Rattus norvegicus (rat)
Description:
P37136
Residue:
614
  
Inhibitor
Name:
BDBM50362874
Synonyms:
CHEMBL1940735
Type:
Small organic molecule
Emp. Form.:
C26H32N2O5
Mol. Mass.:
452.5427
SMILES:
COc1cc2oc(=O)c(C)c(C)c2cc1OCCCN1CCN(CC1)c1ccccc1OC
: