Target
Aldo-keto reductase family 1 member A1
Ligand
BDBM50363062
Substrate
Meas. Tech.
ChEMBL_800762 (CHEMBL1948098)
IC50
15000±n/a nM
Citation
 Minehira, DTakeda, DUrata, HKato, AAdachi, IWang, XMatsuya, YSugimoto, KTakemura, MEndo, SMatsunaga, THara, AKoseki, JNarukawa, KHirono, SToyooka, N Design, synthesis, and biological evaluation of novel (1-thioxo-1,2,3,4-tetrahydro-ß-carbolin-9-yl)acetic acids as selective inhibitors for AKR1B1. Bioorg Med Chem 20:356-67 (2011)  
Target
Name:
Aldo-keto reductase family 1 member A1
Synonyms:
AK1A1_HUMAN ALDR1 Alcohol dehydrogenase [NADP+] Aldehyde reductase | Aldo-keto reductase family 1 member A1
Type:
Enzyme
Mol. Mass.:
36574.11
Organism:
Homo sapiens (Human)
Description:
Residue:
325
  
Inhibitor
Name:
BDBM50363062
Synonyms:
CHEMBL1944853
Type:
Small organic molecule
Emp. Form.:
C20H17ClN2O2S
Mol. Mass.:
384.879
SMILES:
OC(=O)Cn1c2c(CCN(Cc3ccccc3)C2=S)c2cc(Cl)ccc12
: