Target
Matrix metalloproteinase-9
Ligand
BDBM50363129
Substrate
Meas. Tech.
ChEMBL_800775 (CHEMBL1948222)
IC50
60±n/a nM
Citation
 Schrigten, DBreyholz, HJWagner, SHermann, SSchober, OSchäfers, MHaufe, GKopka, K A new generation of radiofluorinated pyrimidine-2,4,6-triones as MMP-targeted radiotracers for positron emission tomography. J Med Chem 55:223-32 (2012)  
Target
Name:
Matrix metalloproteinase-9
Synonyms:
67 kDa matrix metalloproteinase-9 92 kDa gelatinase CLG4B Gelatinase B MMP9 Matrix metalloproteinase 9 (MMP-9) Matrix metalloproteinase-9 (MMP9)
Type:
Enzyme
Mol. Mass.:
78452.28
Organism:
Homo sapiens (Human)
Description:
P14780
Residue:
707
  
Inhibitor
Name:
BDBM50363129
Synonyms:
CHEMBL1946277
Type:
Small organic molecule
Emp. Form.:
C39H47FN8O8
Mol. Mass.:
774.8377
SMILES:
Fc1ncccc1OCCCCc1cn(CCOCCOCCOCCN2CCN(CC2)C2(C(=O)NC(=O)NC2=O)c2ccc(Oc3ccccc3)cc2)nn1
: