Target
Carbonic anhydrase 2
Ligand
BDBM11613
Substrate
Meas. Tech.
ChEMBL_801829 (CHEMBL1947441)
Ki
124±n/a nM
Citation
 Ohradanova, AVullo, DPastorekova, SPastorek, JJackson, DJWörheide, GSupuran, CT Cloning, characterization and sulfonamide inhibition studies of ana-carbonic anhydrase from the living fossil sponge Astrosclera willeyana. Bioorg Med Chem 20:1403-10 (2012)  
Target
Name:
Carbonic anhydrase 2
Synonyms:
CA-II CAC Carbonate dehydratase II Carbonic anhydrase 2 (CA-II) Carbonic anhydrase C Carbonic anhydrase II (CA-II) Carbonic anhydrase II (hCA II) | Carbonic anhydrase isoenzyme II (hCA II)
Type:
Enzyme
Mol. Mass.:
29250.71
Organism:
Homo sapiens (Human)
Description:
P00918
Residue:
260
  
Inhibitor
Name:
BDBM11613
Synonyms:
4-Amino-3,5-diiodobenzenesulfonamide halogenosulfanilamide deriv. 14
Type:
Small organic molecule
Emp. Form.:
C6H6I2N2O2S
Mol. Mass.:
423.998
SMILES:
Nc1c(I)cc(cc1I)S(N)(=O)=O
: