Target
Insulin receptor
Ligand
BDBM50363712
Substrate
Meas. Tech.
ChEMBL_801839 (CHEMBL1947451)
IC50
5.2±n/a nM
Citation
 Cisek, KKuret, J QSAR studies for prediction of cross-ß sheet aggregate binding affinity and selectivity. Bioorg Med Chem 20:1434-41 (2012)  
Target
Name:
Insulin receptor
Synonyms:
INSR INSR_HUMAN Insulin receptor beta subunit
Type:
Receptor Tyrosine Kinase
Mol. Mass.:
156322.60
Organism:
Homo sapiens (Human)
Description:
P06213
Residue:
1382
  
Inhibitor
Name:
BDBM50363712
Synonyms:
CHEMBL1945931
Type:
Small organic molecule
Emp. Form.:
C18H18ClN2S
Mol. Mass.:
329.866
SMILES:
CN(C)c1ccc(\C=C\c2sc3ccc(Cl)cc3[n+]2C)cc1
: