Target
Insulin receptor
Ligand
BDBM50363710
Substrate
Meas. Tech.
ChEMBL_801839 (CHEMBL1947451)
IC50
6±n/a nM
Citation
 Cisek, KKuret, J QSAR studies for prediction of cross-ß sheet aggregate binding affinity and selectivity. Bioorg Med Chem 20:1434-41 (2012)  
Target
Name:
Insulin receptor
Synonyms:
INSR INSR_HUMAN Insulin receptor beta subunit
Type:
Receptor Tyrosine Kinase
Mol. Mass.:
156322.60
Organism:
Homo sapiens (Human)
Description:
P06213
Residue:
1382
  
Inhibitor
Name:
BDBM50363710
Synonyms:
CHEMBL370968
Type:
Small organic molecule
Emp. Form.:
C19H21N2S
Mol. Mass.:
309.448
SMILES:
CC[n+]1c(\C=C\c2ccc(cc2)N(C)C)sc2ccccc12
: