Target
Insulin receptor
Ligand
BDBM50363716
Substrate
Meas. Tech.
ChEMBL_801839 (CHEMBL1947451)
IC50
8±n/a nM
Citation
 Cisek, KKuret, J QSAR studies for prediction of cross-ß sheet aggregate binding affinity and selectivity. Bioorg Med Chem 20:1434-41 (2012)  
Target
Name:
Insulin receptor
Synonyms:
INSR INSR_HUMAN Insulin receptor beta subunit
Type:
Receptor Tyrosine Kinase
Mol. Mass.:
156322.60
Organism:
Homo sapiens (Human)
Description:
P06213
Residue:
1382
  
Inhibitor
Name:
BDBM50363716
Synonyms:
CHEMBL1944956
Type:
Small organic molecule
Emp. Form.:
C19H21N2OS
Mol. Mass.:
325.447
SMILES:
COc1ccc2[n+](C)c(\C=C\c3ccc(cc3)N(C)C)sc2c1
: