Target
Cytochrome P450 3A4
Ligand
BDBM50364644
Substrate
Meas. Tech.
ChEMBL_802673 (CHEMBL1953081)
IC50
70±n/a nM
Citation
 Song, XLi, XRuiz, CHYin, YFeng, YKamenecka, TMCameron, MD Imidazopyridines as selective CYP3A4 inhibitors. Bioorg Med Chem Lett 22:1611-4 (2012)  
Target
Name:
Cytochrome P450 3A4
Synonyms:
Albendazole monooxygenase CP3A4_HUMAN CYP3A4 CYPIIIA4 Cytochrome P450 3A4 (CYP3A4) Nifedipine oxidase Taurochenodeoxycholate 6-alpha-hydroxylase
Type:
Enzyme
Mol. Mass.:
57349.57
Organism:
Homo sapiens (Human)
Description:
Residue:
503
  
Inhibitor
Name:
BDBM50364644
Synonyms:
CHEMBL1951341
Type:
Small organic molecule
Emp. Form.:
C25H24N6O2
Mol. Mass.:
440.4971
SMILES:
O=C(Nc1ccc(cc1)-c1ccnc2nc[nH]c12)Nc1cccc(c1)C(=O)NC1CCCC1
: