Target
Lysosomal Pro-X carboxypeptidase
Ligand
BDBM50364668
Substrate
Meas. Tech.
ChEMBL_802881 (CHEMBL1953699)
IC50
11±n/a nM
Citation
 Shen, HCDing, FXJiang, JVerras, AChabin, RMXu, STong, XChen, QXie, DLassman, MEBhatt, URGarcia-Calvo, MMGeissler, WShen, ZMurphy, BAGorski, JNWiltsie, JSinhaRoy, RHale, JJPinto, SShen, DM Discovery of benzodihydroisofurans as novel, potent, bioavailable and brain-penetrant prolylcarboxypeptidase inhibitors. Bioorg Med Chem Lett 22:1550-6 (2012)  
Target
Name:
Lysosomal Pro-X carboxypeptidase
Synonyms:
Angiotensinase C PCP PRCP Prolylcarboxypeptidase | Prolylcarboxypeptidase (PRCP)
Type:
Enzyme
Mol. Mass.:
55805.19
Organism:
Homo sapiens (Human)
Description:
P42785
Residue:
496
  
Inhibitor
Name:
BDBM50364668
Synonyms:
CHEMBL1951457
Type:
Small organic molecule
Emp. Form.:
C24H21Cl2FN2O
Mol. Mass.:
443.341
SMILES:
Fc1ccc(CN2CCC3(CC2)OC(c2ccccc32)c2cc(Cl)cc(Cl)c2)nc1
: