Target
Leukocyte tyrosine kinase receptor
Ligand
BDBM50364833
Substrate
Meas. Tech.
ChEMBL_803516 (CHEMBL1953264)
IC50
>50000±n/a nM
Citation
 Hada, KSuda, AAsoh, KTsukuda, THasegawa, MSato, YOgawa, KKuramoto, SAoki, YShimma, NIshikawa, TKoyano, H Angiogenesis inhibitors identified by cell-based high-throughput screening: synthesis, structure-activity relationships and biological evaluation of 3-[(E)-styryl]benzamides that specifically inhibit endothelial cell proliferation. Bioorg Med Chem 20:1442-60 (2012)  
Target
Name:
Leukocyte tyrosine kinase receptor
Synonyms:
LTK TYK1
Type:
PROTEIN
Mol. Mass.:
91679.76
Organism:
Homo sapiens (Human)
Description:
ChEMBL_586334
Residue:
864
  
Inhibitor
Name:
BDBM50364833
Synonyms:
CHEMBL1949789
Type:
Small organic molecule
Emp. Form.:
C19H20ClNO4
Mol. Mass.:
361.819
SMILES:
COc1ccc(cc1\C=C\c1ccc(Cl)cc1)C(=O)NC[C@H](O)CO
: